Reaction Details
TargetRibosyldihydronicotinamide dehydrogenase [quinone]
LigandBDBM50342771
Substrate/Competitorn/a
Meas. Tech.ChEMBL_544427 (CHEMBL1016924)
IC50 37.15±n/a nM
Citation Du, HWang, JZhang, XHu, Z A novel quantitative structure-activity relationship method to predict the affinities of MT3 melatonin binding site. Eur J Med Chem43:2861-9 (2008) 
 
Ribosyldihydronicotinamide dehydrogenase [quinone]
Name:Ribosyldihydronicotinamide dehydrogenase [quinone]
Type:Protein
Mol. Mass.:25917.25
Organism:Homo sapiens (Human)
Description:P16083
Residue:231
BDBM50342771
NameBDBM50342771
Synonyms:CHEMBL456646 N-[2-(7-methylsulfinyl-naphth-1-yl)ethyl]acetamide
TypeSmall organic molecule
Emp. Form.C15H17NO2S
Mol. Mass.275.366
SMILESCC(=O)NCCc1cccc2ccc(cc12)S(C)=O