Reaction Details
TargetRibosyldihydronicotinamide dehydrogenase [quinone]
LigandBDBM50413640
Substrate/Competitorn/a
Meas. Tech.ChEMBL_544427 (CHEMBL1016924)
IC50 12.02±n/a nM
Citation Du, HWang, JZhang, XHu, Z A novel quantitative structure-activity relationship method to predict the affinities of MT3 melatonin binding site. Eur J Med Chem43:2861-9 (2008) 
 
Ribosyldihydronicotinamide dehydrogenase [quinone]
Name:Ribosyldihydronicotinamide dehydrogenase [quinone]
Type:Protein
Mol. Mass.:25917.25
Organism:Homo sapiens (Human)
Description:P16083
Residue:231
BDBM50413640
NameBDBM50413640
Synonyms:CHEMBL455339
TypeSmall organic molecule
Emp. Form.C15H16N2O2
Mol. Mass.256.2997
SMILESCNC(=O)c1ccc2cccc(CNC(C)=O)c2c1