Reaction Details
TargetRibosyldihydronicotinamide dehydrogenase [quinone]
LigandBDBM50112201
Substrate/Competitorn/a
Meas. Tech.ChEMBL_544427 (CHEMBL1016924)
IC50 0.309±n/a nM
Citation Du, HWang, JZhang, XHu, Z A novel quantitative structure-activity relationship method to predict the affinities of MT3 melatonin binding site. Eur J Med Chem43:2861-9 (2008) 
 
Ribosyldihydronicotinamide dehydrogenase [quinone]
Name:Ribosyldihydronicotinamide dehydrogenase [quinone]
Type:Protein
Mol. Mass.:25917.25
Organism:Homo sapiens (Human)
Description:P16083
Residue:231
BDBM50112201
NameBDBM50112201
Synonyms:CHEMBL53622 N-[2-(5-Methoxy-1-methyl-4-nitro-1H-indol-3-yl)-ethyl]-acetamide
TypeSmall organic molecule
Emp. Form.C14H17N3O4
Mol. Mass.291.3025
SMILESCOc1ccc2n(C)cc(CCNC(C)=O)c2c1[N+]([O-])=O