Reaction Details
TargetRibosyldihydronicotinamide dehydrogenase [quinone]
LigandBDBM50342773
Substrate/Competitorn/a
Meas. Tech.ChEMBL_544427 (CHEMBL1016924)
IC50 32.36±n/a nM
Citation Du, HWang, JZhang, XHu, Z A novel quantitative structure-activity relationship method to predict the affinities of MT3 melatonin binding site. Eur J Med Chem43:2861-9 (2008) 
 
Ribosyldihydronicotinamide dehydrogenase [quinone]
Name:Ribosyldihydronicotinamide dehydrogenase [quinone]
Type:Protein
Mol. Mass.:25917.25
Organism:Homo sapiens (Human)
Description:P16083
Residue:231
BDBM50342773
NameBDBM50342773
Synonyms:CHEMBL457763 N-[2-(7-sulfamoyl-naphth-1-yl)ethyl]acetamide
TypeSmall organic molecule
Emp. Form.C14H16N2O3S
Mol. Mass.292.353
SMILESCC(=O)NCCc1cccc2ccc(cc12)S(N)(=O)=O