Reaction Details
TargetInhibitor of nuclear factor kappa-B kinase subunit beta
LigandBDBM50413871
Substrate/Competitorn/a
Meas. Tech.ChEMBL_502283 (CHEMBL983954)
IC50 40±n/a nM
Citation Liddle, JBamborough, PBarker, MDCampos, SCousins, RPCutler, GJHobbs, HHolmes, DSIoannou, CMellor, GWMorse, MAPayne, JJPritchard, JMSmith, KJTape, DTWhitworth, CWilliamson, RA 4-Phenyl-7-azaindoles as potent and selective IKK2 inhibitors. Bioorg Med Chem Lett19:2504-8 (2009) 
 
Inhibitor of nuclear factor kappa-B kinase subunit beta
Name:Inhibitor of nuclear factor kappa-B kinase subunit beta
Type:Serine/threonine-protein kinase
Mol. Mass.:86554.39
Organism:Homo sapiens (Human)
Description:GST-tagged IKK-2 was expressed in High Five cells and purified.
Residue:756
BDBM50413871
NameBDBM50413871
Synonyms:CHEMBL473080 | D3RKN_32
TypeSmall organic molecule
Emp. Form.C15H16N4O2S
Mol. Mass.316.378
SMILESNCCNS(=O)(=O)c1ccc(cc1)-c1ccnc2[nH]ccc12