Reaction Details
TargetInhibitor of nuclear factor kappa-B kinase subunit beta
LigandBDBM50413875
Substrate/Competitorn/a
Meas. Tech.ChEMBL_502283 (CHEMBL983954)
IC50 32±n/a nM
Citation Liddle, JBamborough, PBarker, MDCampos, SCousins, RPCutler, GJHobbs, HHolmes, DSIoannou, CMellor, GWMorse, MAPayne, JJPritchard, JMSmith, KJTape, DTWhitworth, CWilliamson, RA 4-Phenyl-7-azaindoles as potent and selective IKK2 inhibitors. Bioorg Med Chem Lett19:2504-8 (2009) 
 
Inhibitor of nuclear factor kappa-B kinase subunit beta
Name:Inhibitor of nuclear factor kappa-B kinase subunit beta
Type:Serine/threonine-protein kinase
Mol. Mass.:86554.39
Organism:Homo sapiens (Human)
Description:GST-tagged IKK-2 was expressed in High Five cells and purified.
Residue:756
BDBM50413875
NameBDBM50413875
Synonyms:CHEMBL482539
TypeSmall organic molecule
Emp. Form.C16H18N4O2S
Mol. Mass.330.405
SMILESCNCCNS(=O)(=O)c1ccc(cc1)-c1ccnc2[nH]ccc12