Reaction Details
TargetInhibitor of nuclear factor kappa-B kinase subunit alpha
LigandBDBM50413877
Substrate/Competitorn/a
Meas. Tech.ChEMBL_502284 (CHEMBL983955)
IC50 32±n/a nM
Citation Liddle, JBamborough, PBarker, MDCampos, SCousins, RPCutler, GJHobbs, HHolmes, DSIoannou, CMellor, GWMorse, MAPayne, JJPritchard, JMSmith, KJTape, DTWhitworth, CWilliamson, RA 4-Phenyl-7-azaindoles as potent and selective IKK2 inhibitors. Bioorg Med Chem Lett19:2504-8 (2009) 
 
Inhibitor of nuclear factor kappa-B kinase subunit alpha
Name:Inhibitor of nuclear factor kappa-B kinase subunit alpha
Type:PROTEIN
Mol. Mass.:84642.21
Organism:Homo sapiens (Human)
Description:ChEMBL_327453
Residue:745
BDBM50413877
NameBDBM50413877
Synonyms:CHEMBL482540
TypeSmall organic molecule
Emp. Form.C16H16N4O2S
Mol. Mass.328.389
SMILESO=S(=O)(NC1CNC1)c1ccc(cc1)-c1ccnc2[nH]ccc12