Reaction Details
TargetInhibitor of nuclear factor kappa-B kinase subunit alpha
LigandBDBM50413879
Substrate/Competitorn/a
Meas. Tech.ChEMBL_502284 (CHEMBL983955)
IC50 1259±n/a nM
Citation Liddle, JBamborough, PBarker, MDCampos, SCousins, RPCutler, GJHobbs, HHolmes, DSIoannou, CMellor, GWMorse, MAPayne, JJPritchard, JMSmith, KJTape, DTWhitworth, CWilliamson, RA 4-Phenyl-7-azaindoles as potent and selective IKK2 inhibitors. Bioorg Med Chem Lett19:2504-8 (2009) 
 
Inhibitor of nuclear factor kappa-B kinase subunit alpha
Name:Inhibitor of nuclear factor kappa-B kinase subunit alpha
Type:PROTEIN
Mol. Mass.:84642.21
Organism:Homo sapiens (Human)
Description:ChEMBL_327453
Residue:745
BDBM50413879
NameBDBM50413879
Synonyms:CHEMBL482553
TypeSmall organic molecule
Emp. Form.C13H11N3O2S
Mol. Mass.273.31
SMILESNS(=O)(=O)c1cccc(c1)-c1ccnc2[nH]ccc12