Reaction Details
TargetInhibitor of nuclear factor kappa-B kinase subunit alpha
LigandBDBM50413886
Substrate/Competitorn/a
Meas. Tech.ChEMBL_502284 (CHEMBL983955)
IC50 7943±n/a nM
Citation Liddle, JBamborough, PBarker, MDCampos, SCousins, RPCutler, GJHobbs, HHolmes, DSIoannou, CMellor, GWMorse, MAPayne, JJPritchard, JMSmith, KJTape, DTWhitworth, CWilliamson, RA 4-Phenyl-7-azaindoles as potent and selective IKK2 inhibitors. Bioorg Med Chem Lett19:2504-8 (2009) 
 
Inhibitor of nuclear factor kappa-B kinase subunit alpha
Name:Inhibitor of nuclear factor kappa-B kinase subunit alpha
Type:PROTEIN
Mol. Mass.:84642.21
Organism:Homo sapiens (Human)
Description:ChEMBL_327453
Residue:745
BDBM50413886
NameBDBM50413886
Synonyms:CHEMBL484966
TypeSmall organic molecule
Emp. Form.C16H17N3O2S
Mol. Mass.315.39
SMILESCN(c1ccc(cc1)-c1ccnc2[nH]c(C)cc12)S(C)(=O)=O