Reaction Details
TargetRho-associated protein kinase 1
LigandBDBM50413882
Substrate/Competitorn/a
Meas. Tech.ChEMBL_502285 (CHEMBL983956)
IC50 316±n/a nM
Citation Liddle, JBamborough, PBarker, MDCampos, SCousins, RPCutler, GJHobbs, HHolmes, DSIoannou, CMellor, GWMorse, MAPayne, JJPritchard, JMSmith, KJTape, DTWhitworth, CWilliamson, RA 4-Phenyl-7-azaindoles as potent and selective IKK2 inhibitors. Bioorg Med Chem Lett19:2504-8 (2009) 
 
Rho-associated protein kinase 1
Name:Rho-associated protein kinase 1
Type:Serine/threonine-protein kinase
Mol. Mass.:158156.77
Organism:Homo sapiens (Human)
Description:Q13464
Residue:1354
BDBM50413882
NameBDBM50413882
Synonyms:CHEMBL482747
TypeSmall organic molecule
Emp. Form.C16H18N4O2S
Mol. Mass.330.405
SMILESCc1cc2c(ccnc2[nH]1)-c1ccc(cc1)S(=O)(=O)NCCN