Reaction Details
TargetInhibitor of nuclear factor kappa-B kinase subunit alpha
LigandBDBM50413885
Substrate/Competitorn/a
Meas. Tech.ChEMBL_502284 (CHEMBL983955)
IC50 3981±n/a nM
Citation Liddle, JBamborough, PBarker, MDCampos, SCousins, RPCutler, GJHobbs, HHolmes, DSIoannou, CMellor, GWMorse, MAPayne, JJPritchard, JMSmith, KJTape, DTWhitworth, CWilliamson, RA 4-Phenyl-7-azaindoles as potent and selective IKK2 inhibitors. Bioorg Med Chem Lett19:2504-8 (2009) 
 
Inhibitor of nuclear factor kappa-B kinase subunit alpha
Name:Inhibitor of nuclear factor kappa-B kinase subunit alpha
Type:PROTEIN
Mol. Mass.:84642.21
Organism:Homo sapiens (Human)
Description:ChEMBL_327453
Residue:745
BDBM50413885
NameBDBM50413885
Synonyms:CHEMBL485145
TypeSmall organic molecule
Emp. Form.C15H15N3O2S
Mol. Mass.301.364
SMILESCc1cc2c(ccnc2[nH]1)-c1ccc(NS(C)(=O)=O)cc1