Reaction Details
TargetPotassium voltage-gated channel subfamily H member 2
LigandBDBM50000483
Substrate/Competitorn/a
Meas. Tech.ChEMBL_572012 (CHEMBL1023674)
IC50 3801.89±n/a nM
Citation Ermondi, GVisentin, SCaron, G GRIND-based 3D-QSAR and CoMFA to investigate topics dominated by hydrophobic interactions: the case of hERG K+ channel blockers. Eur J Med Chem44:1926-32 (2009) 
 
Potassium voltage-gated channel subfamily H member 2
Name:Potassium voltage-gated channel subfamily H member 2
Type:Multi-pass membrane protein
Mol. Mass.:126672.65
Organism:Homo sapiens (Human)
Description:Q12809
Residue:1159
BDBM50000483
NameBDBM50000483
Synonyms:(BRL 43694)1-Methyl-1H-indazole-3-carboxylic acid (9-methyl-9-aza-bicyclo[3.3.1]non-3-yl)-amide 1-Methyl-1H-indazole-3-carboxylic acid (8-methyl-8-aza-bicyclo[3.2.1]oct-3-yl)-amide 1-Methyl-1H-indazole-3-carboxylic acid (9-methyl-9-aza-bicyclo[3.3.1]non-3-yl)-amide(BRL 43694) 1-methyl-N-((1S,5R)-9-methyl-9-aza-bicyclo[3.3.1]nonan-3-yl)-1H-indazole-3-carboxamide BRL 43694 CHEMBL519643 LY-278584
TypeSmall organic molecule
Emp. Form.C18H24N4O
Mol. Mass.312.4094
SMILESCN1C2CCCC1CC(C2)NC(=O)c1nn(C)c2ccccc12