Reaction Details
TargetPotassium voltage-gated channel subfamily H member 2
LigandBDBM50031720
Substrate/Competitorn/a
Meas. Tech.ChEMBL_572012 (CHEMBL1023674)
IC50 12.3±n/a nM
Citation Ermondi, GVisentin, SCaron, G GRIND-based 3D-QSAR and CoMFA to investigate topics dominated by hydrophobic interactions: the case of hERG K+ channel blockers. Eur J Med Chem44:1926-32 (2009) 
 
Potassium voltage-gated channel subfamily H member 2
Name:Potassium voltage-gated channel subfamily H member 2
Type:Multi-pass membrane protein
Mol. Mass.:126672.65
Organism:Homo sapiens (Human)
Description:Q12809
Residue:1159
BDBM50031720
NameBDBM50031720
Synonyms:(Dofetilide) N-[4-(2-{[2-(4-Methanesulfonylamino-phenyl)-ethyl]-methylamino}-ethoxy)-phenyl]-methanesulfonamide DOFETILIDE N-[4-(2-{[2-(4-Methanesulfonylamino-phenyl)-ethyl]-methyl-amino}-ethoxy)-phenyl]-methanesulfonamide (UK-68798) N-[4-(2-{[2-(4-methanesulfonylamino-phenoxy)-ethyl]-methyl-amino}-ethyl)-phenyl]-methanesulfonamide UK-68,798 | US10167299, Dofetilide
TypeSmall organic molecule
Emp. Form.C19H27N3O5S2
Mol. Mass.441.565
SMILESCN(CCOc1ccc(NS(C)(=O)=O)cc1)CCc1ccc(NS(C)(=O)=O)cc1