Reaction Details
TargetPotassium voltage-gated channel subfamily H member 2
LigandBDBM14390
Substrate/Competitorn/a
Meas. Tech.ChEMBL_572012 (CHEMBL1023674)
IC50 100000±n/a nM
Citation Ermondi, GVisentin, SCaron, G GRIND-based 3D-QSAR and CoMFA to investigate topics dominated by hydrophobic interactions: the case of hERG K+ channel blockers. Eur J Med Chem44:1926-32 (2009) 
 
Potassium voltage-gated channel subfamily H member 2
Name:Potassium voltage-gated channel subfamily H member 2
Type:Multi-pass membrane protein
Mol. Mass.:126672.65
Organism:Homo sapiens (Human)
Description:Q12809
Residue:1159
BDBM14390
NameBDBM14390
Synonyms:5-[2-ethoxy-5-(4-methyl-1-piperazinylsulfonyl)phenyl]-1-methyl-3-n-propyl-1,6-dihydro-7H-pyrazolo[4,3-d]pyrimidin-7-one CHEMBL192 Sildenafil US11155558, Compound sildenafil US11897890, Compound sildenafil | Viagra
TypeSmall organic molecule
Emp. Form.C22H30N6O4S
Mol. Mass.474.576
SMILESCCCc1nn(C)c2c1nc([nH]c2=O)-c1cc(ccc1OCC)S(=O)(=O)N1CCN(C)CC1