Reaction Details
TargetP2X purinoceptor 7
LigandBDBM50414305
Substrate/Competitorn/a
Meas. Tech.ChEMBL_574385 (CHEMBL1028693)
IC50 0.2±n/a nM
Citation Guile, SDAlcaraz, LBirkinshaw, TNBowers, KCEbden, MRFurber, MStocks, MJ Antagonists of the P2X(7) receptor. From lead identification to drug development. J Med Chem52:3123-41 (2009) 
 
P2X purinoceptor 7
Name:P2X purinoceptor 7
Type:Protein
Mol. Mass.:68602.85
Organism:Homo sapiens (Human)
Description:Q99572
Residue:595
BDBM50414305
NameBDBM50414305
Synonyms:CHEMBL551360
TypeSmall organic molecule
Emp. Form.C24H30N2O4
Mol. Mass.410.506
SMILESOCC(CO)n1ccc2c(NC(=O)CC34CC5CC(CC(C5)C3)C4)cccc2c1=O