Reaction Details
TargetHistamine H4 receptor
LigandBDBM50414373
Substrate/Competitorn/a
Meas. Tech.ChEMBL_576569 (CHEMBL1034550)
Ki 12.59±n/a nM
Citation Lim, HDIstyastono, EPvan de Stolpe, ARomeo, GGobbi, SSchepers, MLahaye, RMenge, WMZuiderveld, OPJongejan, ASmits, RABakker, RAHaaksma, EELeurs, Rde Esch, IJ Clobenpropit analogs as dual activity ligands for the histamine H3 and H4 receptors: synthesis, pharmacological evaluation, and cross-target QSAR studies. Bioorg Med Chem17:3987-94 (2009) 
 
Histamine H4 receptor
Name:Histamine H4 receptor
Type:G Protein-Coupled Receptor (GPCR)
Mol. Mass.:44517.02
Organism:Homo sapiens (Human)
Description:Binding assays were using CHO cells stably expressing hH4R receptors.
Residue:390
BDBM50414373
NameBDBM50414373
Synonyms:CHEMBL1202319
TypeSmall organic molecule
Emp. Form.C15H20N4OS
Mol. Mass.304.41
SMILESCOc1ccc(CN=C(N)SCCCc2cnc[nH]2)cc1