Reaction Details
TargetD(3) dopamine receptor
LigandBDBM50414435
Substrate/Competitorn/a
Meas. Tech.ChEMBL_577522 (CHEMBL1057874)
Ki 1.26±n/a nM
Citation Micheli, FHolmes, IArista, LBonanomi, GBraggio, SCardullo, FDi Fabio, RDonati, DGentile, GHamprecht, DTerreni, SHeidbreder, CSavoia, CGriffante, CWorby, A Dopamine D(3) receptor antagonists: The quest for a potentially selective PET ligand. Part two: Lead optimization. Bioorg Med Chem Lett19:4011-3 (2009) 
 
D(3) dopamine receptor
Name:D(3) dopamine receptor
Type:n/a
Mol. Mass.:44243.43
Organism:Homo sapiens (Human)
Description:n/a
Residue:400
BDBM50414435
NameBDBM50414435
Synonyms:CHEMBL569846
TypeSmall organic molecule
Emp. Form.C17H22F3N3O2
Mol. Mass.357.3707
SMILESOc1cccc(c1)N1CCN(CCN2CCC(CC2)C(F)(F)F)C1=O