Reaction Details
TargetD(3) dopamine receptor
LigandBDBM50414437
Substrate/Competitorn/a
Meas. Tech.ChEMBL_577522 (CHEMBL1057874)
Ki 1.58±n/a nM
Citation Micheli, FHolmes, IArista, LBonanomi, GBraggio, SCardullo, FDi Fabio, RDonati, DGentile, GHamprecht, DTerreni, SHeidbreder, CSavoia, CGriffante, CWorby, A Dopamine D(3) receptor antagonists: The quest for a potentially selective PET ligand. Part two: Lead optimization. Bioorg Med Chem Lett19:4011-3 (2009) 
 
D(3) dopamine receptor
Name:D(3) dopamine receptor
Type:n/a
Mol. Mass.:44243.43
Organism:Homo sapiens (Human)
Description:n/a
Residue:400
BDBM50414437
NameBDBM50414437
Synonyms:CHEMBL562624
TypeSmall organic molecule
Emp. Form.C17H21ClF3N3O
Mol. Mass.375.816
SMILESFC(F)(F)C1CCN(CCN2CCN(C2=O)c2cccc(Cl)c2)CC1