Reaction Details
TargetNeuropeptide FF receptor 1
LigandBDBM50414852
Substrate/Competitorn/a
Meas. Tech.ChEMBL_590511 (CHEMBL1058558)
EC50 79.43±n/a nM
Citation Gaubert, GBertozzi, FKelly, NMPawlas, JScully, ALNash, NRGardell, LRLameh, JOlsson, R Discovery of selective nonpeptidergic neuropeptide FF2 receptor agonists. J Med Chem52:6511-4 (2009) 
 
Neuropeptide FF receptor 1
Name:Neuropeptide FF receptor 1
Type:PROTEIN
Mol. Mass.:47840.07
Organism:Homo sapiens (Human)
Description:ChEMBL_1474637
Residue:430
BDBM50414852
NameBDBM50414852
Synonyms:CHEMBL573738
TypeSmall organic molecule
Emp. Form.C13H14N4O
Mol. Mass.242.2765
SMILES[#6]-c1ccccc1-c1ccc(-[#6]=[#7]\[#7]=[#6](\[#7])-[#7])o1