Reaction Details
TargetEukaryotic translation initiation factor 2-alpha kinase 1
LigandBDBM50414868
Substrate/Competitorn/a
Meas. Tech.ChEMBL_589403 (CHEMBL1058424)
IC50>10000±n/a nM
Citation Rosen, MDWoods, CRGoldberg, SDHack, MDBounds, ADYang, YWagaman, PCPhuong, VKAmeriks, APBarrett, TDKanelakis, KCChuang, JCChang, JShankley, NPRabinowitz, MH Discovery of the first known small-molecule inhibitors of heme-regulated eukaryotic initiation factor 2alpha (HRI) kinase. Bioorg Med Chem Lett19:6548-51 (2009) 
 
Eukaryotic translation initiation factor 2-alpha kinase 1
Name:Eukaryotic translation initiation factor 2-alpha kinase 1
Type:PROTEIN
Mol. Mass.:71098.55
Organism:Homo sapiens (Human)
Description:ChEMBL_1467744
Residue:630
BDBM50414868
NameBDBM50414868
Synonyms:CHEMBL574630
TypeSmall organic molecule
Emp. Form.C19H18ClN3O
Mol. Mass.339.819
SMILESCOc1cccc2Cc3c(NCc4c(C)cccc4Cl)[nH]nc3-c12