Reaction Details
TargetD(3) dopamine receptor
LigandBDBM50414568
Substrate/Competitorn/a
Meas. Tech.ChEMBL_598588 (CHEMBL1044429)
Ki 39.81±n/a nM
Citation Bennacef, ISalinas, CABonasera, TAGunn, RNAudrain, HJakobsen, SNabulsi, NWeinzimmer, DCarson, REHuang, YHolmes, IMicheli, FHeidbreder, CGentile, GRossi, TLaruelle, M Dopamine D3 receptor antagonists: the quest for a potentially selective PET ligand. Part 3: Radiosynthesis and in vivo studies. Bioorg Med Chem Lett19:5056-9 (2009) 
 
D(3) dopamine receptor
Name:D(3) dopamine receptor
Type:n/a
Mol. Mass.:44243.43
Organism:Homo sapiens (Human)
Description:n/a
Residue:400
BDBM50414568
NameBDBM50414568
Synonyms:CHEMBL562836
TypeSmall organic molecule
Emp. Form.C22H32FN3O
Mol. Mass.373.5074
SMILESCN(CCN1CCN(C1=O)c1ccc(F)cc1)C[C@@]12CC[C@@H](CC1)C2(C)C