Reaction Details
TargetD(2) dopamine receptor
LigandBDBM50414555
Substrate/Competitorn/a
Meas. Tech.ChEMBL_598589 (CHEMBL1044430)
Ki 25.12±n/a nM
Citation Bennacef, ISalinas, CABonasera, TAGunn, RNAudrain, HJakobsen, SNabulsi, NWeinzimmer, DCarson, REHuang, YHolmes, IMicheli, FHeidbreder, CGentile, GRossi, TLaruelle, M Dopamine D3 receptor antagonists: the quest for a potentially selective PET ligand. Part 3: Radiosynthesis and in vivo studies. Bioorg Med Chem Lett19:5056-9 (2009) 
 
D(2) dopamine receptor
Name:D(2) dopamine receptor
Type:Cell-surface receptors
Mol. Mass.:50647.10
Organism:Homo sapiens (Human)
Description:P14416
Residue:443
BDBM50414555
NameBDBM50414555
Synonyms:CHEMBL565075
TypeSmall organic molecule
Emp. Form.C19H26ClN3O
Mol. Mass.347.882
SMILESClc1cccc(c1)N1CCN(CCN2C[C@H]3CC[C@H](CC3)C2)C1=O