Reaction Details
TargetD(2) dopamine receptor
LigandBDBM50414556
Substrate/Competitorn/a
Meas. Tech.ChEMBL_598589 (CHEMBL1044430)
Ki 31.62±n/a nM
Citation Bennacef, ISalinas, CABonasera, TAGunn, RNAudrain, HJakobsen, SNabulsi, NWeinzimmer, DCarson, REHuang, YHolmes, IMicheli, FHeidbreder, CGentile, GRossi, TLaruelle, M Dopamine D3 receptor antagonists: the quest for a potentially selective PET ligand. Part 3: Radiosynthesis and in vivo studies. Bioorg Med Chem Lett19:5056-9 (2009) 
 
D(2) dopamine receptor
Name:D(2) dopamine receptor
Type:Cell-surface receptors
Mol. Mass.:50647.10
Organism:Homo sapiens (Human)
Description:P14416
Residue:443
BDBM50414556
NameBDBM50414556
Synonyms:CHEMBL564930
TypeSmall organic molecule
Emp. Form.C21H30ClN3O
Mol. Mass.375.935
SMILESCC1(C)[C@H]2CC[C@]1(C)CN(CCN1CCN(C1=O)c1cccc(Cl)c1)C2