Reaction Details
TargetCannabinoid receptor 2
LigandBDBM50415109
Substrate/Competitorn/a
Meas. Tech.ChEMBL_597715 (CHEMBL1043502)
EC50 316.23±n/a nM
Citation Gleave, RJBeswick, PJBrown, AJGiblin, GMHaslam, CPLivermore, DMoses, ANicholson, NHPage, LWSlingsby, BSwarbrick, ME 2-Amino-5-aryl-pyridines as selective CB2 agonists: synthesis and investigation of structure-activity relationships. Bioorg Med Chem Lett19:6578-81 (2009) 
 
Cannabinoid receptor 2
Name:Cannabinoid receptor 2
Type:G Protein-Coupled Receptor (GPCR)
Mol. Mass.:39690.94
Organism:Homo sapiens (Human)
Description:P34972
Residue:360
BDBM50415109
NameBDBM50415109
Synonyms:CHEMBL570219
TypeSmall organic molecule
Emp. Form.C16H17Cl2N3
Mol. Mass.322.232
SMILESClc1cnc(c(Cl)c1)-c1ccc(nc1)N1CCCCCC1