Reaction Details
TargetCannabinoid receptor 2
LigandBDBM50415113
Substrate/Competitorn/a
Meas. Tech.ChEMBL_597715 (CHEMBL1043502)
EC50 1584.89±n/a nM
Citation Gleave, RJBeswick, PJBrown, AJGiblin, GMHaslam, CPLivermore, DMoses, ANicholson, NHPage, LWSlingsby, BSwarbrick, ME 2-Amino-5-aryl-pyridines as selective CB2 agonists: synthesis and investigation of structure-activity relationships. Bioorg Med Chem Lett19:6578-81 (2009) 
 
Cannabinoid receptor 2
Name:Cannabinoid receptor 2
Type:G Protein-Coupled Receptor (GPCR)
Mol. Mass.:39690.94
Organism:Homo sapiens (Human)
Description:P34972
Residue:360
BDBM50415113
NameBDBM50415113
Synonyms:CHEMBL571333
TypeSmall organic molecule
Emp. Form.C18H18Cl2N2O2
Mol. Mass.365.254
SMILESOC(=O)c1cc(cnc1N1CCCCCC1)-c1cccc(Cl)c1Cl