Reaction Details
TargetCannabinoid receptor 2
LigandBDBM50415122
Substrate/Competitorn/a
Meas. Tech.ChEMBL_597715 (CHEMBL1043502)
EC50 501.19±n/a nM
Citation Gleave, RJBeswick, PJBrown, AJGiblin, GMHaslam, CPLivermore, DMoses, ANicholson, NHPage, LWSlingsby, BSwarbrick, ME 2-Amino-5-aryl-pyridines as selective CB2 agonists: synthesis and investigation of structure-activity relationships. Bioorg Med Chem Lett19:6578-81 (2009) 
 
Cannabinoid receptor 2
Name:Cannabinoid receptor 2
Type:G Protein-Coupled Receptor (GPCR)
Mol. Mass.:39690.94
Organism:Homo sapiens (Human)
Description:P34972
Residue:360
BDBM50415122
NameBDBM50415122
Synonyms:CHEMBL577556
TypeSmall organic molecule
Emp. Form.C16H17ClN2O
Mol. Mass.288.772
SMILESCc1c(Cl)cccc1-c1ccc(nc1)N1CCOCC1