Reaction Details
TargetCannabinoid receptor 1
LigandBDBM50415111
Substrate/Competitorn/a
Meas. Tech.ChEMBL_597718 (CHEMBL1043505)
EC50 10000±n/a nM
Citation Gleave, RJBeswick, PJBrown, AJGiblin, GMHaslam, CPLivermore, DMoses, ANicholson, NHPage, LWSlingsby, BSwarbrick, ME 2-Amino-5-aryl-pyridines as selective CB2 agonists: synthesis and investigation of structure-activity relationships. Bioorg Med Chem Lett19:6578-81 (2009) 
 
Cannabinoid receptor 1
Name:Cannabinoid receptor 1
Type:G Protein-Coupled Receptor (GPCR)
Mol. Mass.:52868.96
Organism:Homo sapiens (Human)
Description:P21554
Residue:472
BDBM50415111
NameBDBM50415111
Synonyms:CHEMBL570683
TypeSmall organic molecule
Emp. Form.C22H25Cl2N3O2
Mol. Mass.434.359
SMILESClc1cccc(-c2cnc(N3CCCCCC3)c(c2)C(=O)N2CCOCC2)c1Cl