Reaction Details
TargetCannabinoid receptor 1
LigandBDBM50415116
Substrate/Competitorn/a
Meas. Tech.ChEMBL_597718 (CHEMBL1043505)
EC50 10000±n/a nM
Citation Gleave, RJBeswick, PJBrown, AJGiblin, GMHaslam, CPLivermore, DMoses, ANicholson, NHPage, LWSlingsby, BSwarbrick, ME 2-Amino-5-aryl-pyridines as selective CB2 agonists: synthesis and investigation of structure-activity relationships. Bioorg Med Chem Lett19:6578-81 (2009) 
 
Cannabinoid receptor 1
Name:Cannabinoid receptor 1
Type:G Protein-Coupled Receptor (GPCR)
Mol. Mass.:52868.96
Organism:Homo sapiens (Human)
Description:P21554
Residue:472
BDBM50415116
NameBDBM50415116
Synonyms:CHEMBL576087
TypeSmall organic molecule
Emp. Form.C18H17Cl2N3
Mol. Mass.346.254
SMILESClc1cccc(c1Cl)-c1cnc(cc1C#N)N1CCCCCC1