Reaction Details
TargetCannabinoid receptor 1
LigandBDBM50415134
Substrate/Competitorn/a
Meas. Tech.ChEMBL_597718 (CHEMBL1043505)
EC50 10000±n/a nM
Citation Gleave, RJBeswick, PJBrown, AJGiblin, GMHaslam, CPLivermore, DMoses, ANicholson, NHPage, LWSlingsby, BSwarbrick, ME 2-Amino-5-aryl-pyridines as selective CB2 agonists: synthesis and investigation of structure-activity relationships. Bioorg Med Chem Lett19:6578-81 (2009) 
 
Cannabinoid receptor 1
Name:Cannabinoid receptor 1
Type:G Protein-Coupled Receptor (GPCR)
Mol. Mass.:52868.96
Organism:Homo sapiens (Human)
Description:P21554
Residue:472
BDBM50415134
NameBDBM50415134
Synonyms:CHEMBL576079
TypeSmall organic molecule
Emp. Form.C17H18Cl2N2
Mol. Mass.321.244
SMILESClc1cccc(-c2ccc(nc2)N2CCCCCC2)c1Cl