Reaction Details
TargetMuscarinic acetylcholine receptor M3
LigandBDBM50415145
Substrate/Competitorn/a
Meas. Tech.ChEMBL_596257 (CHEMBL1048033)
Ki 1.66±n/a nM
Citation Scapecchi, SNesi, MMatucci, RBellucci, CBuccioni, MDei, SGuandalini, LManetti, DMartelli, CMartini, EMarucci, GOrlandi, FRomanelli, MNTeodori, ECirilli, R Synthesis, affinity profile and functional activity of potent chiral muscarinic antagonists with a pyrrolidinylfuran structure. J Med Chem53:201-7 (2010) 
 
Muscarinic acetylcholine receptor M3
Name:Muscarinic acetylcholine receptor M3
Type:Enzyme
Mol. Mass.:66151.03
Organism:Homo sapiens (Human)
Description:P20309
Residue:590
BDBM50415145
NameBDBM50415145
Synonyms:CHEMBL571121
TypeSmall organic molecule
Emp. Form.C22H29NO2
Mol. Mass.339.4712
SMILESCN1CCC[C@@H]1c1ccc(o1)[C@@](O)(C1CCCCC1)c1ccccc1