Reaction Details
TargetMuscarinic acetylcholine receptor M5
LigandBDBM50415152
Substrate/Competitorn/a
Meas. Tech.ChEMBL_596259 (CHEMBL1048035)
Ki 11.48±n/a nM
Citation Scapecchi, SNesi, MMatucci, RBellucci, CBuccioni, MDei, SGuandalini, LManetti, DMartelli, CMartini, EMarucci, GOrlandi, FRomanelli, MNTeodori, ECirilli, R Synthesis, affinity profile and functional activity of potent chiral muscarinic antagonists with a pyrrolidinylfuran structure. J Med Chem53:201-7 (2010) 
 
Muscarinic acetylcholine receptor M5
Name:Muscarinic acetylcholine receptor M5
Type:PROTEIN
Mol. Mass.:60102.35
Organism:Homo sapiens (Human)
Description:ChEMBL_1517990
Residue:532
BDBM50415152
NameBDBM50415152
Synonyms:CHEMBL569760
TypeSmall organic molecule
Emp. Form.C23H32NO2
Mol. Mass.354.5051
SMILESC[N+]1(C)CCCC1c1ccc(o1)C(O)(C1CCCCC1)c1ccccc1