Reaction Details
TargetMuscarinic acetylcholine receptor M1
LigandBDBM50006584
Substrate/Competitorn/a
Meas. Tech.ChEMBL_605172 (CHEMBL1067394)
Ki 1949.84±n/a nM
Citation Piergentili, AQuaglia, WDel Bello, FGiannella, MPigini, MBarocelli, EBertoni, SMatucci, RNesi, MBruni, BDi Vaira, M Properly substituted 1,4-dioxane nucleus favours the selective M3 muscarinic receptor activation. Bioorg Med Chem17:8174-85 (2009) 
 
Muscarinic acetylcholine receptor M1
Name:Muscarinic acetylcholine receptor M1
Type:Protein
Mol. Mass.:51442.54
Organism:Homo sapiens (Human)
Description:P11229
Residue:460
BDBM50006584
NameBDBM50006584
Synonyms:(McN-A-343) [4-(3-Chloro-phenylcarbamoyloxy)-but-2-ynyl]-trimethyl-ammonium; chloride 4-(3-chlorophenylcarbamoyloxy)-N,N,N-trimethylbut-2-yn-1-aminium CHEMBL40554 McN-A-343 [4-(3-Chloro-phenylcarbamoyloxy)-but-2-ynyl]-trimethyl-ammonium; chloride (McN-A-343)
TypeSmall organic molecule
Emp. Form.C14H18ClN2O2
Mol. Mass.281.757
SMILESC[N+](C)(C)CC#CCOC(=O)Nc1cccc(Cl)c1