Reaction Details
TargetSubstance-P receptor
LigandBDBM50415264
Substrate/Competitorn/a
Meas. Tech.ChEMBL_604256 (CHEMBL1050401)
Ki 20.0±n/a nM
Citation Sabbatini, FMDi Fabio, RGriffante, CPentassuglia, GZonzini, LMelotto, SAlvaro, GCapelli, AMPippo, LPerdona', ESt Denis, YCosta, SCorsi, M Synthesis and pharmacological characterization of constrained analogues of Vestipitant as in vitro potent and orally active NK(1) receptor antagonists. Bioorg Med Chem Lett20:623-7 (2010) 
 
Substance-P receptor
Name:Substance-P receptor
Type:G Protein-Coupled Receptor (GPCR)
Mol. Mass.:46254.43
Organism:Homo sapiens (Human)
Description:P25103
Residue:407
BDBM50415264
NameBDBM50415264
Synonyms:CHEMBL591074
TypeSmall organic molecule
Emp. Form.C25H24F7N3O
Mol. Mass.515.4664
SMILESCc1cc(F)ccc1[C@H]1CNCCN1C(=O)N1CCC=CC1c1cc(cc(c1)C(F)(F)F)C(F)(F)F