Reaction Details
TargetSubstance-P receptor
LigandBDBM50415265
Substrate/Competitorn/a
Meas. Tech.ChEMBL_604256 (CHEMBL1050401)
Ki 31.6±n/a nM
Citation Sabbatini, FMDi Fabio, RGriffante, CPentassuglia, GZonzini, LMelotto, SAlvaro, GCapelli, AMPippo, LPerdona', ESt Denis, YCosta, SCorsi, M Synthesis and pharmacological characterization of constrained analogues of Vestipitant as in vitro potent and orally active NK(1) receptor antagonists. Bioorg Med Chem Lett20:623-7 (2010) 
 
Substance-P receptor
Name:Substance-P receptor
Type:G Protein-Coupled Receptor (GPCR)
Mol. Mass.:46254.43
Organism:Homo sapiens (Human)
Description:P25103
Residue:407
BDBM50415265
NameBDBM50415265
Synonyms:CHEMBL591075
TypeSmall organic molecule
Emp. Form.C25H26F7N3O
Mol. Mass.517.4823
SMILESCc1cc(F)ccc1[C@H]1CNCCN1C(=O)N1CCCCC1c1cc(cc(c1)C(F)(F)F)C(F)(F)F