Reaction Details
TargetCholinesterase
LigandBDBM50415465
Substrate/Competitorn/a
Meas. Tech.ChEMBL_610789 (CHEMBL1068106)
IC50 5.89±n/a nM
Citation Fang, LJumpertz, SZhang, YAppenroth, DFleck, CMohr, KTränkle, CDecker, M Hybrid molecules from xanomeline and tacrine: enhanced tacrine actions on cholinesterases and muscarinic M1 receptors. J Med Chem53:2094-103 (2010) 
 
Cholinesterase
Name:Cholinesterase
Type:Enzyme
Mol. Mass.:65643.35
Organism:Equus caballus (Horse)
Description:P81908
Residue:574
BDBM50415465
NameBDBM50415465
Synonyms:CHEMBL589409
TypeSmall organic molecule
Emp. Form.C33H46N6O3S
Mol. Mass.606.822
SMILESCN1CCC=C(C1)c1nsnc1OCCCOCCCCC(=O)NCCCCNc1c2CCCCc2nc2ccccc12