Reaction Details
TargetCholinesterase
LigandBDBM50415470
Substrate/Competitorn/a
Meas. Tech.ChEMBL_610789 (CHEMBL1068106)
IC50 10.72±n/a nM
Citation Fang, LJumpertz, SZhang, YAppenroth, DFleck, CMohr, KTränkle, CDecker, M Hybrid molecules from xanomeline and tacrine: enhanced tacrine actions on cholinesterases and muscarinic M1 receptors. J Med Chem53:2094-103 (2010) 
 
Cholinesterase
Name:Cholinesterase
Type:Enzyme
Mol. Mass.:65643.35
Organism:Equus caballus (Horse)
Description:P81908
Residue:574
BDBM50415470
NameBDBM50415470
Synonyms:CHEMBL599243
TypeSmall organic molecule
Emp. Form.C30H40N6O3S
Mol. Mass.564.742
SMILESCN1CCC=C(C1)c1nsnc1OCCCOCCC(=O)NCCCNc1c2CCCCc2nc2ccccc12