Reaction Details
TargetAcetylcholinesterase
LigandBDBM50415462
Substrate/Competitorn/a
Meas. Tech.ChEMBL_610788 (CHEMBL1068105)
IC50 6.46±n/a nM
Citation Fang, LJumpertz, SZhang, YAppenroth, DFleck, CMohr, KTränkle, CDecker, M Hybrid molecules from xanomeline and tacrine: enhanced tacrine actions on cholinesterases and muscarinic M1 receptors. J Med Chem53:2094-103 (2010) 
 
Acetylcholinesterase
Name:Acetylcholinesterase
Type:Enzyme
Mol. Mass.:71812.79
Organism:Electrophorus electricus (Electric eel)
Description:n/a
Residue:633
BDBM50415462
NameBDBM50415462
Synonyms:CHEMBL589384
TypeSmall organic molecule
Emp. Form.C36H52N6O3S
Mol. Mass.648.901
SMILESCN1CCC=C(C1)c1nsnc1OCCCOCCCC(=O)NCCCCCCCCNc1c2CCCCc2nc2ccccc12