Reaction Details
TargetLeucyl-cystinyl aminopeptidase
LigandBDBM50415629
Substrate/Competitorn/a
Meas. Tech.ChEMBL_619204 (CHEMBL1100890)
Ki 794.33±n/a nM
Citation Lukaszuk, ADemaegdt, HFeytens, DVanderheyden, PVauquelin, GTourwé, D The replacement of His(4) in angiotensin IV by conformationally constrained residues provides highly potent and selective analogues. J Med Chem52:5612-8 (2009) 
 
Leucyl-cystinyl aminopeptidase
Name:Leucyl-cystinyl aminopeptidase
Type:PROTEIN
Mol. Mass.:117334.10
Organism:Homo sapiens (Human)
Description:ChEMBL_1473494
Residue:1025
BDBM50415629
NameBDBM50415629
Synonyms:CHEMBL1077583
TypeSmall organic molecule
Emp. Form.C44H55N7O8
Mol. Mass.809.9496
SMILESCC[C@H](C)[C@H](NC(=O)[C@H](Cc1ccc(O)cc1)NC(=O)[C@@H](CN)C(C)C)C(=O)N[C@H]1Cc2c(CN(CC(=O)N[C@@H](Cc3ccccc3)C(O)=O)C1=O)[nH]c1ccccc21