Reaction Details
TargetAminopeptidase N
LigandBDBM85550
Substrate/Competitorn/a
Meas. Tech.ChEMBL_619203 (CHEMBL1100889)
Ki 56.23±n/a nM
Citation Lukaszuk, ADemaegdt, HFeytens, DVanderheyden, PVauquelin, GTourwé, D The replacement of His(4) in angiotensin IV by conformationally constrained residues provides highly potent and selective analogues. J Med Chem52:5612-8 (2009) 
 
Aminopeptidase N
Name:Aminopeptidase N
Type:PROTEIN
Mol. Mass.:109522.63
Organism:Homo sapiens (Human)
Description:ChEMBL_1507526
Residue:967
BDBM85550
NameBDBM85550
Synonyms:Ang IV CHEMBL261120 | cid_123814
TypeSmall organic molecule
Emp. Form.C40H54N8O8
Mol. Mass.774.9056
SMILESCC[C@H](C)[C@H](NC(=O)[C@H](Cc1ccc(O)cc1)NC(=O)[C@@H](N)C(C)C)C(=O)N[C@@H](Cc1cnc[nH]1)C(=O)N1CCC[C@H]1C(=O)N[C@@H](Cc1ccccc1)C(O)=O