Reaction Details
TargetOxysterols receptor LXR-beta
LigandBDBM50415826
Substrate/Competitorn/a
Meas. Tech.ChEMBL_625546 (CHEMBL1109726)
IC50 398±n/a nM
Citation Zuercher, WJBuckholz, RGCampobasso, NCollins, JLGalardi, CMGampe, RTHyatt, SMMerrihew, SLMoore, JTOplinger, JAReid, PRSpearing, PKStanley, TBStewart, ELWillson, TM Discovery of tertiary sulfonamides as potent liver X receptor antagonists. J Med Chem53:3412-6 (2010) 
 
Oxysterols receptor LXR-beta
Name:Oxysterols receptor LXR-beta
Type:Enzyme Catalytic Domain
Mol. Mass.:50978.79
Organism:Homo sapiens (Human)
Description:P55055
Residue:460
BDBM50415826
NameBDBM50415826
Synonyms:CHEMBL1090238
TypeSmall organic molecule
Emp. Form.C31H32FN3O2S
Mol. Mass.529.668
SMILESFc1ccc(cc1)S(=O)(=O)N(Cc1ccccc1)Cc1ccc(cc1)-c1cccc(CN2CCNCC2)c1