Reaction Details
TargetOxysterols receptor LXR-beta
LigandBDBM50415823
Substrate/Competitorn/a
Meas. Tech.ChEMBL_625546 (CHEMBL1109726)
IC50<10000±n/a nM
Citation Zuercher, WJBuckholz, RGCampobasso, NCollins, JLGalardi, CMGampe, RTHyatt, SMMerrihew, SLMoore, JTOplinger, JAReid, PRSpearing, PKStanley, TBStewart, ELWillson, TM Discovery of tertiary sulfonamides as potent liver X receptor antagonists. J Med Chem53:3412-6 (2010) 
 
Oxysterols receptor LXR-beta
Name:Oxysterols receptor LXR-beta
Type:Enzyme Catalytic Domain
Mol. Mass.:50978.79
Organism:Homo sapiens (Human)
Description:P55055
Residue:460
BDBM50415823
NameBDBM50415823
Synonyms:CHEMBL1090570
TypeSmall organic molecule
Emp. Form.C27H23ClFN
Mol. Mass.415.93
SMILESFc1ccc(CN(Cc2ccccc2)Cc2ccc(cc2)-c2ccccc2)c(Cl)c1