Reaction Details
TargetOxysterols receptor LXR-beta
LigandBDBM50415820
Substrate/Competitorn/a
Meas. Tech.ChEMBL_625546 (CHEMBL1109726)
IC50 6.3±n/a nM
Citation Zuercher, WJBuckholz, RGCampobasso, NCollins, JLGalardi, CMGampe, RTHyatt, SMMerrihew, SLMoore, JTOplinger, JAReid, PRSpearing, PKStanley, TBStewart, ELWillson, TM Discovery of tertiary sulfonamides as potent liver X receptor antagonists. J Med Chem53:3412-6 (2010) 
 
Oxysterols receptor LXR-beta
Name:Oxysterols receptor LXR-beta
Type:Enzyme Catalytic Domain
Mol. Mass.:50978.79
Organism:Homo sapiens (Human)
Description:P55055
Residue:460
BDBM50415820
NameBDBM50415820
Synonyms:CHEMBL1093840
TypeSmall organic molecule
Emp. Form.C24H23ClFNO4S2
Mol. Mass.508.025
SMILESCS(=O)(=O)c1cccc(c1)-c1ccc(CN(Cc2c(F)cccc2Cl)S(=O)(=O)C2CC2)cc1