Reaction Details
TargetOxysterols receptor LXR-beta
LigandBDBM50415819
Substrate/Competitorn/a
Meas. Tech.ChEMBL_625546 (CHEMBL1109726)
IC50 13±n/a nM
Citation Zuercher, WJBuckholz, RGCampobasso, NCollins, JLGalardi, CMGampe, RTHyatt, SMMerrihew, SLMoore, JTOplinger, JAReid, PRSpearing, PKStanley, TBStewart, ELWillson, TM Discovery of tertiary sulfonamides as potent liver X receptor antagonists. J Med Chem53:3412-6 (2010) 
 
Oxysterols receptor LXR-beta
Name:Oxysterols receptor LXR-beta
Type:Enzyme Catalytic Domain
Mol. Mass.:50978.79
Organism:Homo sapiens (Human)
Description:P55055
Residue:460
BDBM50415819
NameBDBM50415819
Synonyms:CHEMBL1091976
TypeSmall organic molecule
Emp. Form.C28H25ClFNO4S2
Mol. Mass.558.084
SMILESCc1ccccc1S(=O)(=O)N(Cc1ccc(cc1)-c1cccc(c1)S(C)(=O)=O)Cc1c(F)cccc1Cl