Reaction Details
TargetHistamine H2 receptor
LigandBDBM50415915
Substrate/Competitorn/a
Meas. Tech.ChEMBL_629743 (CHEMBL1121103)
EC50 6.46±n/a nM
Citation Ghorai, PKraus, ABirnkammer, TGeyer, RBernhardt, GDove, SSeifert, RElz, SBuschauer, A Chiral NG-acylated hetarylpropylguanidine-type histamine H2 receptor agonists do not show significant stereoselectivity. Bioorg Med Chem Lett20:3173-6 (2010) 
 
Histamine H2 receptor
Name:Histamine H2 receptor
Type:G Protein-Coupled Receptor (GPCR)
Mol. Mass.:40115.31
Organism:Homo sapiens (Human)
Description:n/a
Residue:359
BDBM50415915
NameBDBM50415915
Synonyms:CHEMBL1096431
TypeSmall organic molecule
Emp. Form.C17H29N5O
Mol. Mass.319.4451
SMILESC[C@@H](CC(=O)NC(N)=NCCCc1cnc[nH]1)C1CCCCC1