Reaction Details
TargetHistamine H2 receptor
LigandBDBM50415919
Substrate/Competitorn/a
Meas. Tech.ChEMBL_629743 (CHEMBL1121103)
EC50 9.33±n/a nM
Citation Ghorai, PKraus, ABirnkammer, TGeyer, RBernhardt, GDove, SSeifert, RElz, SBuschauer, A Chiral NG-acylated hetarylpropylguanidine-type histamine H2 receptor agonists do not show significant stereoselectivity. Bioorg Med Chem Lett20:3173-6 (2010) 
 
Histamine H2 receptor
Name:Histamine H2 receptor
Type:G Protein-Coupled Receptor (GPCR)
Mol. Mass.:40115.31
Organism:Homo sapiens (Human)
Description:n/a
Residue:359
BDBM50415919
NameBDBM50415919
Synonyms:CHEMBL1094144
TypeSmall organic molecule
Emp. Form.C18H31N5OS
Mol. Mass.365.537
SMILESC[C@@H](CC(=O)NC(N)=NCCCc1sc(N)nc1C)C1CCCCC1