Reaction Details
TargetHistamine H2 receptor
LigandBDBM50415921
Substrate/Competitorn/a
Meas. Tech.ChEMBL_629745 (CHEMBL1121257)
EC50 13.18±n/a nM
Citation Ghorai, PKraus, ABirnkammer, TGeyer, RBernhardt, GDove, SSeifert, RElz, SBuschauer, A Chiral NG-acylated hetarylpropylguanidine-type histamine H2 receptor agonists do not show significant stereoselectivity. Bioorg Med Chem Lett20:3173-6 (2010) 
 
Histamine H2 receptor
Name:Histamine H2 receptor
Type:G Protein-Coupled Receptor (GPCR)
Mol. Mass.:40567.22
Organism:Cavia porcellus (domestic guinea pig)
Description:For the H2 receptor-binding assays, guinea pig striatum was used.
Residue:359
BDBM50415921
NameBDBM50415921
Synonyms:CHEMBL1094452
TypeSmall organic molecule
Emp. Form.C18H31N5OS
Mol. Mass.365.537
SMILESC[C@H](CC(=O)NC(N)=NCCCc1sc(N)nc1C)C1CCCCC1