Reaction Details
TargetHistamine H3 receptor
LigandBDBM50415917
Substrate/Competitorn/a
Meas. Tech.ChEMBL_629749 (CHEMBL1121261)
EC50 1.86±n/a nM
Citation Ghorai, PKraus, ABirnkammer, TGeyer, RBernhardt, GDove, SSeifert, RElz, SBuschauer, A Chiral NG-acylated hetarylpropylguanidine-type histamine H2 receptor agonists do not show significant stereoselectivity. Bioorg Med Chem Lett20:3173-6 (2010) 
 
Histamine H3 receptor
Name:Histamine H3 receptor
Type:G Protein-Coupled Receptor (GPCR)
Mol. Mass.:48691.47
Organism:Homo sapiens (Human)
Description:Binding assays were using CHO cells stably expressing hH3R receptors.
Residue:445
BDBM50415917
NameBDBM50415917
Synonyms:CHEMBL1096429
TypeSmall organic molecule
Emp. Form.C17H23N5O
Mol. Mass.313.3974
SMILESC[C@@H](CC(=O)NC(N)=NCCCc1cnc[nH]1)c1ccccc1