Reaction Details
TargetGlucocorticoid receptor
LigandBDBM50416101
Substrate/Competitorn/a
Meas. Tech.ChEMBL_634771 (CHEMBL1119507)
IC50 12.59±n/a nM
Citation Yates, CMBrown, PJStewart, ELPatten, CAustin, RJHolt, JAMaglich, JMAngell, DCSasse, RZTaylor, SJUings, IJTrump, RP Structure guided design of 5-arylindazole glucocorticoid receptor agonists and antagonists. J Med Chem53:4531-44 (2010) 
 
Glucocorticoid receptor
Name:Glucocorticoid receptor
Type:Enzyme
Mol. Mass.:85656.87
Organism:Homo sapiens (Human)
Description:P04150
Residue:777
BDBM50416101
NameBDBM50416101
Synonyms:CHEMBL1082780
TypeSmall organic molecule
Emp. Form.C24H15F4N3O2S2
Mol. Mass.517.518
SMILESFc1ccc(cc1)-n1ncc2cc(ccc12)-c1ccc(NS(=O)(=O)c2ccsc2)cc1C(F)(F)F