Reaction Details
TargetGlucocorticoid receptor
LigandBDBM50416082
Substrate/Competitorn/a
Meas. Tech.ChEMBL_634771 (CHEMBL1119507)
IC50 10±n/a nM
Citation Yates, CMBrown, PJStewart, ELPatten, CAustin, RJHolt, JAMaglich, JMAngell, DCSasse, RZTaylor, SJUings, IJTrump, RP Structure guided design of 5-arylindazole glucocorticoid receptor agonists and antagonists. J Med Chem53:4531-44 (2010) 
 
Glucocorticoid receptor
Name:Glucocorticoid receptor
Type:Enzyme
Mol. Mass.:85656.87
Organism:Homo sapiens (Human)
Description:P04150
Residue:777
BDBM50416082
NameBDBM50416082
Synonyms:CHEMBL1085625
TypeSmall organic molecule
Emp. Form.C22H17F4N3O2S
Mol. Mass.463.448
SMILESCCS(=O)(=O)Nc1ccc(-c2ccc3n(ncc3c2)-c2ccc(F)cc2)c(c1)C(F)(F)F