Reaction Details
TargetAndrogen receptor
LigandBDBM50416081
Substrate/Competitorn/a
Meas. Tech.ChEMBL_634773 (CHEMBL1119509)
IC50 5011.87±n/a nM
Citation Yates, CMBrown, PJStewart, ELPatten, CAustin, RJHolt, JAMaglich, JMAngell, DCSasse, RZTaylor, SJUings, IJTrump, RP Structure guided design of 5-arylindazole glucocorticoid receptor agonists and antagonists. J Med Chem53:4531-44 (2010) 
 
Androgen receptor
Name:Androgen receptor
Type:Receptor
Mol. Mass.:99185.27
Organism:Homo sapiens (Human)
Description:CHO cells were stably transfected with human AR gene.
Residue:920
BDBM50416081
NameBDBM50416081
Synonyms:CHEMBL1084360
TypeSmall organic molecule
Emp. Form.C21H15F4N3O2S
Mol. Mass.449.421
SMILESCS(=O)(=O)Nc1ccc(-c2ccc3n(ncc3c2)-c2ccc(F)cc2)c(c1)C(F)(F)F